{"text_format":"1","workbook":"xlsx","n_sheets":15,"sheets":["COVER SHEET","SURVEY SUMMARY","SURVEY MANDAY ESTIMATE","SURVEY LABOR & DIRECT EXPENSES","DESIGN MANDAYS A","DESIGN MANDAYS B","DESIGN LABOR & AVG. M.D.","DESIGN DIRECT EXPENSES","FEE PROPOSAL","FEE PROPOSAL SUMMARY","Net Fee Calculator","SURVEY FORMS REVISIONS","DESIGN FORM REVISIONS","SURVEY MANDAY FORM INSTRUCTIONS","Module1"],"not_rendered":{"charts":0,"images":3,"macros":1,"external_links":0,"defined_names":14,"comments":0,"pivot_tables":0},"unopened":[{"sheet":"Module1","index":14,"reason":"part_missing"}],"bounds":{"document_bytes":16777216,"sheet_cells":100000,"rows_first":2000,"rows_last":500,"rows_between":2000,"halvings":0,"cell_chars":16384,"cell_head_chars":4096},"cells_cut":0,"cells_raw":0,"read":"whole","date_system":"1900"}

{"sheet":"COVER SHEET","index":0,"n_rows":84,"n_cols":19,"rows_kept":84,"cut":false,"hidden":false,"merged":[[63,0,63,2],[64,0,64,2],[55,0,55,8],[57,0,57,2],[60,0,60,2],[61,0,61,2],[10,0,10,8],[24,0,29,8],[62,0,62,2],[54,0,54,2],[47,0,47,8],[49,0,49,2],[50,0,50,2],[52,0,52,2],[15,1,15,7],[13,1,13,7],[36,3,36,6],[39,0,39,1],[38,0,38,1],[42,0,42,1],[17,2,17,6],[19,2,19,6],[23,0,23,8],[34,3,34,6],[35,3,35,6],[37,3,37,6],[45,0,45,1],[44,0,44,1],[41,0,41,1],[38,3,38,6],[39,3,39,6]]}
[null,{"$f":"IF(ISNONTEXT(A43),\"\",\"Instructions:\")","v":"Instructions:"}]
[null,{"$f":"IF(ISNONTEXT(A43),\"\",\"(Enter state route number, project description,county, consultant's name,\")","v":"(Enter state route number, project description,county, consultant's name,"}]
[null,{"$f":"IF(ISNONTEXT(A43),\"\",\"prepared by name, and date prepared.  This information will be transferred\")","v":"prepared by name, and date prepared.  This information will be transferred"}]
[null,{"$f":"IF(ISNONTEXT(A43),\"\",\"to all other sheets. The date prepared must be entered in the appropriate\")","v":"to all other sheets. The date prepared must be entered in the appropriate"}]
[null,{"$f":"IF(ISNONTEXT(A43),\"\",\"cell on this sheet to remove these instructions prior to printing.)\")","v":"cell on this sheet to remove these instructions prior to printing.)"}]
[]
["TENNESSEE DEPARTMENT OF TRANSPORTATION"]
[]
["MANDAY ESTIMATE AND FEE PROPOSAL"]
[]
["Click Here to Select Type of Proposal from Drop Down List"]
[]
[]
[null,"<Route>"]
[]
{"$rows_left_out":70}
{"sheet":"SURVEY SUMMARY","index":1,"n_rows":52,"n_cols":7,"rows_kept":52,"cut":false,"hidden":false,"merged":[[5,5,6,6],[28,2,28,3],[35,2,35,3]]}
[]
[]
["Route:",{"$f":"'COVER SHEET'!B14","v":"<Route>"},null,{"$f":"'COVER SHEET'!A43","v":"<Date>"}]
["Description:",{"$f":"'COVER SHEET'!B16","v":"<Description>"}]
["County:",{"$f":"'COVER SHEET'!C18","v":"<County>"}]
["Consultant:",{"$f":"'COVER SHEET'!D35","v":"<Consultant>"},null,null,null,"INPUT SIDEROADS LT & RT OF CENTERLINE"]
["Prepared By:",{"$f":"'COVER SHEET'!A40","v":"<Name>"}]
["Project No.:",{"$f":"'COVER SHEET'!A46","v":"<00000-0000-00>"},null,null,null,"Sideroad Name","Length (feet)"]
["Mainline Project Length:",0,"(miles)"]
["Number of Sideroads:",{"$f":"26-COUNTBLANK(F9:F34)","v":0},"Length:",{"$f":"G35","v":0},"(feet)"]
["Office Travel Time per day (hrs):",0]
["Crew Travel Time per day (hrs):",0]
["Crew Work per day (hrs):",8]
[]
["Number of Existing Lanes:",0,"Proposed:",0]
{"$rows_left_out":38}
{"sheet":"SURVEY MANDAY ESTIMATE","index":2,"n_rows":39,"n_cols":18,"rows_kept":39,"cut":false,"hidden":false,"merged":[[10,11,11,11],[10,12,11,12]]}
["ESTIMATE FOR FIELD SURVEYS"]
["PROJECT DESCRIPTION:",null,null,null,null,null,null,null,{"$f":"'COVER SHEET'!G46","v":"Version 2.27"},null,"PROJECT DESCRIPTION:",null,null,null,null,null,null,{"$f":"'COVER SHEET'!G46","v":"Version 2.27"}]
["Route:",{"$f":"'SURVEY SUMMARY'!B3","v":"<Route>"},null,null,null,null,null,null,null,null,null,null,"Route:",{"$f":"'SURVEY SUMMARY'!B3","v":"<Route>"}]
["Description:",{"$f":"'SURVEY SUMMARY'!B4","v":"<Description>"},null,null,null,null,null,null,null,null,null,null,"Description:",{"$f":"'SURVEY SUMMARY'!B4","v":"<Description>"}]
["County:",{"$f":"'SURVEY SUMMARY'!B5","v":"<County>"},null,null,null,"Prepared By:",{"$f":"'SURVEY SUMMARY'!B7","v":"<Name>"},null,null,null,null,null,"County:",{"$f":"'SURVEY SUMMARY'!B5","v":"<County>"}]
["Consultant:",{"$f":"'SURVEY SUMMARY'!B6","v":"<Consultant>"},null,null,null,null,null,"Date Prepared:",{"$f":"'SURVEY SUMMARY'!D3","v":"<Date>"},null,null,null,"Consultant:",{"$f":"'SURVEY SUMMARY'!B6","v":"<Consultant>"}]
["Project No.:",{"$f":"'COVER SHEET'!A46","v":"<00000-0000-00>"},null,null,null,null,null,null,null,null,null,null,"Project No.:",{"$f":"'COVER SHEET'!A46","v":"<00000-0000-00>"}]
["TOTAL LENGTH(miles):",{"$f":"ROUND('SURVEY SUMMARY'!B9+('SURVEY SUMMARY'!D10/5280)-(O22/5280),3)","v":0},null,null,null,null,null,null,null,null,null,null,null,"TOTAL LENGTH(miles):",{"$f":"'SURVEY SUMMARY'!B9+('SURVEY SUMMARY'!D10/5280)-(('SURVEY SUMMARY'!B10*0.5*'SURVEY SUMMARY'!B35)/5280)","v":0}]
["OFFICE TRAVEL TIME PER DAY(hrs):",{"$f":"'SURVEY SUMMARY'!B11","v":0},null,null,null,null,null,null,null,null,null,null,"Date Prepared:",{"$f":"'SURVEY SUMMARY'!D3","v":"<Date>"},null,"Prepared By:",{"$f":"'SURVEY SUMMARY'!B7","v":"<Name>"}]
["CREW TRAVEL TIME PER DAY(hrs):",{"$f":"'SURVEY SUMMARY'!B12","v":0}]
["ACTIVITY","PROJECT MANAGER","OFFICE CADD TECH.","PARTY CHIEF"," INSTRUMENT MAN","RODMAN","RODMAN","FLAGGER","FLAGGER",null,null,"OFFICE DIFFICULTY","FIELD    DIFFICULTY"]
[null,"PM","O","P","I","R","R","F","F","Total",null,null,null,null,"REMARKS"]
["1.Establish & Stake Alignments",{"$f":"ROUND(L13*B8/2.48548,1)","v":0},{"$f":"ROUND(L13*B8/3.7282,1)","v":0},{"$f":"ROUND(M13*B8/0.497096,1)","v":0},{"$f":"D13","v":0},{"$f":"D13","v":0},{"$f":"D13","v":0},null,null,{"$f":"ROUND(SUM(B13:I13),1)","v":0},"Align.",0.5,0.5]
["2. Update Survey",{"$f":"ROUND(0.5*D14*L14,1)","v":0},{"$f":"ROUND(0.5*D14*L14,1)","v":0},{"$f":"ROUND(3*'SURVEY SUMMARY'!B29*M14,1)","v":0},0,0,0,null,null,0,"Update",1,1,{"$f":"'SURVEY SUMMARY'!B29","v":0},"Survey Updates"]
["3. Control Traverses",{"$f":"ROUND(L15*B8/1.8641098,1)","v":0},{"$f":"ROUND(L15*B8/6.213699,1)","v":0},{"$f":"ROUND(M15*B8/1.49128787,1)","v":0},0,0,0,null,null,0,"Control",1,0.5]
{"$rows_left_out":25}
{"sheet":"SURVEY LABOR & DIRECT EXPENSES","index":3,"n_rows":60,"n_cols":25,"rows_kept":60,"cut":false,"hidden":false,"merged":[[27,4,27,8],[28,4,28,8]]}
[]
[]
[null,null,"SURVEY DIRECT LABOR COST",null,null,null,null,null,null,null,null,null,null,null,null,null,null,null,{"$f":"'COVER SHEET'!G46","v":"Version 2.27"}]
[null,null,null,null,null,null,null,null,null,null,null,null,"SURVEY DIRECT EXPENSES"]
[]
[null,"PROJECT DESCRIPTION:",null,null,null,null,null,null,null,null,null,null,"PROJECT DESCRIPTION:"]
[null,"ROUTE:",null,{"$f":"'SURVEY SUMMARY'!B3","v":"<Route>"},null,null,null,null,null,null,null,null,"ROUTE:",{"$f":"'SURVEY SUMMARY'!B3","v":"<Route>"}]
[null,"DESCRIPTION:",null,{"$f":"'SURVEY SUMMARY'!B4","v":"<Description>"},null,null,null,null,null,null,null,null,"DESCRIPTION:",{"$f":"'SURVEY SUMMARY'!B4","v":"<Description>"}]
[null,"COUNTY:",null,{"$f":"'SURVEY SUMMARY'!B5","v":"<County>"},null,null,null,null,null,null,null,null,"COUNTY:",{"$f":"'SURVEY SUMMARY'!B5","v":"<County>"},null,"Prepared By:",{"$f":"'SURVEY SUMMARY'!B7","v":"<Name>"}]
[null,"CONSULTANT:",null,{"$f":"'SURVEY SUMMARY'!B6","v":"<Consultant>"},null,"Prepared By:",{"$f":"'SURVEY SUMMARY'!B7","v":"<Name>"},null,null,null,null,null,"CONSULTANT:",{"$f":"'SURVEY SUMMARY'!B6","v":"<Consultant>"},null,"Date Prepared:",{"$f":"'SURVEY SUMMARY'!D3","v":"<Date>"}]
[null,"TOTAL LENGTH(miles):",null,{"$f":"'SURVEY SUMMARY'!B9+'SURVEY SUMMARY'!D10/5280","v":0},null,"Date Prepared:",{"$f":"'SURVEY SUMMARY'!D3","v":"<Date>"},null,null,null,null,null,"TOTAL LENGTH(miles):",{"$f":"'SURVEY SUMMARY'!B9+'SURVEY SUMMARY'!D10/5280","v":0},null,"Project No.:",{"$f":"'COVER SHEET'!A46","v":"<00000-0000-00>"}]
[]
[null,null,null,null,null,null,null,null,null,null,null,null,null,null,null,null,null,"Item Subtotal","Item Total Cost"]
[null,null,null,null,null,null,null,null,null,null,null,null,"Reproduction Costs"]
[null,null,null,"Abbrv.","Personnel Classification"," 8 - Hr Man-Days",{"$f":"IF('SURVEY SUMMARY'!$B$13=8,\"\",(('SURVEY SUMMARY'!$B$13&\" - Hr Man-Days\")))","v":""},"Approved Hours","Rate Per Hr","Direct Labor",{"$f":"IF('SURVEY SUMMARY'!$B$13=8,\"\",\"* Premium\")","v":""}]
{"$rows_left_out":46}
{"sheet":"DESIGN MANDAYS A","index":4,"n_rows":55,"n_cols":7,"rows_kept":55,"cut":false,"hidden":false,"merged":[]}
[null,"DESIGN MANDAY ESTIMATE",null,"PAGE A"]
[]
[null,"ROUTE:",null,{"$f":"'COVER SHEET'!B14","v":"<Route>"}]
[null,"DESCRIPTION:",null,{"$f":"'COVER SHEET'!B16","v":"<Description>"}]
[null,"COUNTY:",null,{"$f":"'COVER SHEET'!C18","v":"<County>"}]
[null,"CONSULTANT:",null,{"$f":"'COVER SHEET'!D35","v":"<Consultant>"}]
[null,"Prepared By:",null,{"$f":"'COVER SHEET'!A40","v":"<Name>"}]
[null,"Date Prepared:",null,{"$f":"'COVER SHEET'!A43","v":"<Date>"}]
[null,"Project No.:",null,{"$f":"'COVER SHEET'!A46","v":"<00000-0000-00>"},null,null,{"$f":"'COVER SHEET'!G46","v":"Version 2.27"}]
[]
["I.","PROJECT LENGTH",null,null,{"$f":"IF(ISBLANK(A53),\"(enter project length in miles)\",\"\")","v":"(enter project length in miles)"},null,"MILES"]
[]
[]
["II.","TYPICAL SECTIONS",{"$f":"IF(ISBLANK(A53),\"(enter length of appropriate section or sections)\",\"\")","v":"(enter length of appropriate section or sections)"}]
[null,"A.  NEW ALIGNMENT"]
{"$rows_left_out":41}
{"sheet":"DESIGN MANDAYS B","index":5,"n_rows":66,"n_cols":7,"rows_kept":66,"cut":false,"hidden":false,"merged":[]}
[null,"DESIGN MANDAY ESTIMATE",null,"PAGE B"]
[]
[null,"ROUTE:",null,{"$f":"'COVER SHEET'!B14","v":"<Route>"}]
[null,"DESCRIPTION:",null,{"$f":"'COVER SHEET'!B16","v":"<Description>"}]
[null,"COUNTY:",null,{"$f":"'COVER SHEET'!C18","v":"<County>"}]
[null,"CONSULTANT:",null,{"$f":"'COVER SHEET'!D35","v":"<Consultant>"}]
[null,"Prepared By:",null,{"$f":"'COVER SHEET'!A40","v":"<Name>"}]
[null,"Date Prepared:",null,{"$f":"'COVER SHEET'!A43","v":"<Date>"}]
[null,"Project No.:",null,{"$f":"'COVER SHEET'!A46","v":"<00000-0000-00>"},null,null,{"$f":"'COVER SHEET'!G46","v":"Version 2.27"}]
[]
["IV.","ADDITIONAL FACTORS"]
[null,"Note:  Consultant to provide supplemental information for items listed below as deemed necessary."]
[null,"A.  SIDEROADS"]
[null,"       (Measure from end of radius return)",null,"110 M.D./ Mile",null,{"$f":"IF(ISBLANK(E14),0,E14*110)","v":0},"MANDAYS"]
[null,"E.  RIGHT-OF-WAY"]
{"$rows_left_out":52}
{"sheet":"DESIGN LABOR & AVG. M.D.","index":6,"n_rows":69,"n_cols":7,"rows_kept":69,"cut":false,"hidden":false,"merged":[]}
["LABOR RATES"]
[]
[null,"ROUTE:",null,{"$f":"'COVER SHEET'!B14","v":"<Route>"},"Project No.:",null,{"$f":"'COVER SHEET'!A46","v":"<00000-0000-00>"}]
[null,"DESCRIPTION:",null,{"$f":"'COVER SHEET'!B16","v":"<Description>"},"PIN No.:",null,{"$f":"'COVER SHEET'!C20","v":"<000000.00>"}]
[null,"COUNTY:",null,{"$f":"'COVER SHEET'!C18","v":"<County>"}]
[null,"CONSULTANT:",null,{"$f":"'COVER SHEET'!A40","v":"<Name>"}]
[null,"Prepared By:",null,{"$f":"'COVER SHEET'!A40","v":"<Name>"}]
[null,"Date Prepared:",null,{"$f":"'COVER SHEET'!A43","v":"<Date>"}]
[null,{"$f":"IF(ISBLANK($A$69),\"This sheet calculates the average mandays, labor cost, and average manday rate for each phase of a project.\",\"\")","v":"This sheet calculates the average mandays, labor cost, and average manday rate for each phase of a project."}]
[null,{"$f":"IF(ISBLANK(A69),\"In the shaded blocks, enter the manday rate for each classification of personnel and the estimated percentage\",\"\")","v":"In the shaded blocks, enter the manday rate for each classification of personnel and the estimated percentage"}]
[null,{"$f":"IF(ISBLANK(A69),\"for both the total project and the individual phases.\",\"\")","v":"for both the total project and the individual phases."}]
[null,{"$f":"IF(ISBLANK($A$69),\"Boxes that are not applicable should be left blank.\",\"\")","v":"Boxes that are not applicable should be left blank."},null,null,null,null,{"$f":"'COVER SHEET'!G46","v":"Version 2.27"}]
["PERSONNEL",null,null,null,"MANDAY RATE"]
["PROJECT MANAGER"]
["PROJECT ENGINEER"]
{"$rows_left_out":55}
{"sheet":"DESIGN DIRECT EXPENSES","index":7,"n_rows":61,"n_cols":7,"rows_kept":61,"cut":false,"hidden":false,"merged":[]}
[]
[]
["DESIGN DIRECT EXPENSES                                                                                                                                        "]
[null,null,null,null,null,null,{"$f":"'COVER SHEET'!G46","v":"Version 2.27"}]
["ROUTE:",null,{"$f":"'COVER SHEET'!B14","v":"<Route>"},"Project No.:",null,{"$f":"'COVER SHEET'!A46","v":"<00000-0000-00>"}]
["DESCRIPTION:",null,{"$f":"'COVER SHEET'!B16","v":"<Description>"},"PIN No.:",null,{"$f":"'COVER SHEET'!C20","v":"<000000.00>"}]
["COUNTY:",null,{"$f":"'COVER SHEET'!C18","v":"<County>"}]
["CONSULTANT:",null,{"$f":"'COVER SHEET'!D35","v":"<Consultant>"}]
["Prepared By:",null,{"$f":"'COVER SHEET'!A40","v":"<Name>"}]
["Date Prepared:",null,{"$f":"'COVER SHEET'!A43","v":"<Date>"}]
[]
[null,null,null,null,null,"Item Subtotal","Item Total Cost"]
["Reproduction Costs:"]
[null,null,null,{"$f":"IF(ISBLANK(B57),\"(Enter quantity and unit price)\",\"\")","v":"(Enter quantity and unit price)"}]
[null,"Item Description",null,"Number / Unit","Unit Price"]
{"$rows_left_out":47}
{"sheet":"FEE PROPOSAL","index":8,"n_rows":148,"n_cols":11,"rows_kept":148,"cut":false,"hidden":false,"merged":[[14,0,14,2],[21,5,21,8],[22,5,22,8]]}
["FEE PROPOSAL"]
[]
["ROUTE:",null,{"$f":"'COVER SHEET'!B14","v":"<Route>"},null,null,null,"Project No.:",null,{"$f":"'COVER SHEET'!A46","v":"<00000-0000-00>"}]
["DESCRIPTION:",null,{"$f":"'COVER SHEET'!B16","v":"<Description>"},null,null,null,"PIN No.:",null,{"$f":"'COVER SHEET'!C20","v":"<000000.00>"}]
["COUNTY:",null,{"$f":"'COVER SHEET'!C18","v":"<County>"}]
["CONSULTANT:",null,{"$f":"'COVER SHEET'!D35","v":"<Consultant>"}]
["Prepared By:",null,{"$f":"'COVER SHEET'!A40","v":"<Name>"}]
["Date Prepared:",null,{"$f":"'COVER SHEET'!A43","v":"<Date>"}]
[{"$f":"IF(ISBLANK(A25),\"COMPLETE SURVEY SHEETS FIRST IF SURVEY IS INCLUDED IN THE CONTRACT.\",\"\")","v":"COMPLETE SURVEY SHEETS FIRST IF SURVEY IS INCLUDED IN THE CONTRACT."}]
[{"$f":"IF(ISBLANK(A25),\"PROCEED WITH FEE PROPOSAL IF SURVEY IS NOT INCLUDED.\",\"\")","v":"PROCEED WITH FEE PROPOSAL IF SURVEY IS NOT INCLUDED."}]
[{"$f":"IF(ISBLANK(A25),\"This sheet perfoms fee proposal calculations for each phase of the project and total project. Net Fee is computed by Net Fee Calculator \",\"\")","v":"This sheet perfoms fee proposal calculations for each phase of the project and total project. Net Fee is computed by Net Fee Calculator "}]
[{"$f":"IF(ISBLANK(A25),\"Enter the appropriate overhead rate & fill in shaded boxes that apply for each phase.\",\"\")","v":"Enter the appropriate overhead rate & fill in shaded boxes that apply for each phase."},null,null,null,null,null,null,null,{"$f":"I50","v":"Version 2.27"}]
[]
["Data For Fee Calculations"]
["Overhead Rate  =",null,null,null,"**",null,{"$f":"IF('COVER SHEET'!F37=\"Sub:\",\"Overhead Rate** =\",\"\")","v":""}]
{"$rows_left_out":134}
{"sheet":"FEE PROPOSAL SUMMARY","index":9,"n_rows":54,"n_cols":11,"rows_kept":54,"cut":false,"hidden":false,"merged":[]}
[null,"FEE PROPOSAL SUMMARY"]
[]
[null,"ROUTE:",null,{"$f":"'COVER SHEET'!B14","v":"<Route>"},null,"Project No.:",null,{"$f":"'COVER SHEET'!A46","v":"<00000-0000-00>"}]
[null,"DESCRIPTION:",null,{"$f":"'COVER SHEET'!B16","v":"<Description>"},null,"PIN No.:",null,{"$f":"'COVER SHEET'!C20","v":"<000000.00>"}]
[null,"COUNTY:",null,{"$f":"'COVER SHEET'!C18","v":"<County>"}]
[null,"CONSULTANT:",null,{"$f":"'COVER SHEET'!D35","v":"<Consultant>"}]
[null,"Prepared By:",null,{"$f":"'COVER SHEET'!A40","v":"<Name>"}]
[null,"Date Prepared:",null,{"$f":"'COVER SHEET'!A43","v":"<Date>"}]
[null,{"$f":"IF(ISBLANK(A54),\"mark the appropriate box below an values for the initial ceiling will be calculated.\",\"\")","v":"mark the appropriate box below an values for the initial ceiling will be calculated."}]
[null,null,null,null,null,null,null,null,null,null,{"$f":"'COVER SHEET'!G46","v":"Version 2.27"}]
[null,"Survey Fee Proposal Summary"]
[null,null,"Direct Labor","Overhead","Subtotal","Net Fee","Subtotal","Direct ","Premium ","Total"]
[null,null,null,null,"Direct Labor &",null,"Direct Labor,","Expense","Labor","Phase"]
[null,null,null,null,"Overhead",null,"Overhead, &"]
[null,null,null,null,null,null,"Net Fee"]
{"$rows_left_out":40}
{"sheet":"Net Fee Calculator","index":10,"n_rows":45,"n_cols":8,"rows_kept":45,"cut":false,"hidden":false,"merged":[[45,0,45,5],[46,1,46,5],[34,0,34,5],[34,6,34,7],[35,0,35,5],[35,6,35,7],[43,0,43,5],[44,0,44,5],[29,0,29,5],[29,6,29,7],[30,6,30,7],[31,6,31,7],[32,6,32,7],[33,6,33,7],[24,6,24,7],[25,6,25,7],[26,6,26,7],[27,6,27,7],[28,0,28,5],[28,6,28,7],[19,6,19,7],[20,6,20,7],[21,6,21,7],[22,0,22,5],[22,6,22,7],[23,0,23,5],[23,6,23,7],[15,6,15,7],[16,0,16,5],[16,6,16,7],[17,0,17,5],[17,6,17,7],[18,6,18,7],[6,5,6,7],[7,5,7,7],[8,5,8,7],[9,0,9,5],[9,6,9,7],[10,0,10,5],[0,1,0,7],[1,1,1,7],[2,1,2,7],[3,1,3,7],[4,5,4,7],[5,5,5,7]]}
[null,"Tennessee Department of Transportation"]
[null,"Fixed Fee Worksheet"]
[null," ( 8% base plus)"]
[null,"Project Description:"]
[null,"Route:"]
[null,"Termini:"]
[null,"County:"]
[null,"Consultant:"]
[null,"Other:"]
["Size of Contract",null,null,null,null,null,"The smaller the phase(s) of work negotiated in a project specific type contract or the smaller the work order negotiated in an on-call type contract, the higher the additional fixed fee percentage."]
["% Additional Fee",null,null,null,null,null,"     Qualifier"]
[null,null,0,false,{"$f":"IF(AND(D12=TRUE,D13=FALSE,D14=FALSE,D15=FALSE),C12)","v":false},22222222,"More than $2,000,000"]
[null,null,0.5,false,{"$f":"IF(AND(D13=TRUE,D12=FALSE,D14=FALSE,D15=FALSE),C13)","v":false},111,"Less than $2,000,000"]
[null,null,1,false,{"$f":"IF(AND(D14=TRUE,D12=FALSE,D13=FALSE,D15=FALSE),C14)","v":false},"ddddddddddddd","Less than $500,000"]
[null,null,2,false,{"$f":"IF(AND(D15=TRUE,D12=FALSE,D13=FALSE,D14=FALSE),C15)","v":false},"ddddddddddddd","Less than $50,000"]
{"$rows_left_out":31}
{"sheet":"SURVEY FORMS REVISIONS","index":11,"n_rows":42,"n_cols":13,"rows_kept":42,"cut":false,"hidden":false,"merged":[]}
[{"$f":"'COVER SHEET'!G46","v":"Version 2.27"}]
["REVISIONS TO EXCEL MAN-DAY SPREADSHEET"]
["SURVEY FORMS"]
["Date ",null,"Worksheet Revised","Version","Description",null,null,null,null,null,null,null,"Revised By"]
[null,null,null,null,null,null,null,null,null,null,null,null,"JHW"]
["1998-06-01",null,"Survey Manday",null,"Changed travel time equations to match discussion at meeting of May 4, 1998.",null,null,null,null,null,null,null,"JHW"]
["1998-06-01",null,"Survey Manday Form Instructions",null,"Changed travel time equations to match discussion at meeting of May 4, 1998.",null,null,null,null,null,null,null,"JRG"]
["1998-06-01",null,"All Sheets",null,"Changed gray background to a lighter shade of gray for copying and faxing.",null,null,null,null,null,null,null,"JHW"]
["1998-06-01",null,"Survey Summary",null,"Changed the number of decimal places on the English project length to two.",null,null,null,null,null,null,null,"JHW"]
["1998-06-01",null,"Survey Summary",null,"Changed culvert site background to gray with red text to prompt for allowable manual input.",null,null,null,null,null,null,null,"JHW"]
["1998-06-01",null,"Survey Labor & Direct Expenses",null,"Changed default values and some of the format of profit rate.",null,null,null,null,null,null,null,"JHW"]
["1998-06-08",null,"Survey Manday",null,"Changed equation for mandays/km &mandays/mile to include only mainline length.",null,null,null,null,null,null,null,"JHW"]
["1998-06-22",null,"Survey Summary & Survey Manday",null,"Changed travel time to allow for crew and aoofce varying rates.",null,null,null,null,null,null,null,"JHW"]
["1998-06-22",null,"All Sheets",null,"Added Version Number on all pages except for Instructions Page.",null,null,null,null,null,null,null,"JHW"]
["1998-06-22",null,"Survey Manday Form Instructions",null,"Modified Equations to match travel.",null,null,null,null,null,null,null,"JHW"]
{"$rows_left_out":28}
{"sheet":"DESIGN FORM REVISIONS","index":12,"n_rows":61,"n_cols":12,"rows_kept":61,"cut":false,"hidden":false,"merged":[]}
[]
["REVISIONS TO EXCEL MAN-DAY SPREADSHEET"]
["DESIGN FORMS & FEE PROPOSAL SHEETS"]
[]
[null,null,null,null,null,null,null,null,null,null,null,{"$f":"'COVER SHEET'!G46","v":"Version 2.27"}]
["Date ",null,"Worksheet Revised","Version","Description",null,null,null,null,null,null,"Revised By"]
[]
["1998-07-21",null,"All sheets",1.01,"1) Add cover sheet, design direct expenses sheet, design form revisions sheet.",null,null,null,null,null,null,"MA"]
[null,null,null,null,"2) Added survey manday estimate sheets (Equations and factors match"]
[null,null,null,null,"survey estimate version 1.01.)"]
[null,null,null,null,"3) Added version to all sheets."]
[null,null,null,null,"4) Added instructions to design sheets."]
["1998-07-21",null,"Fee Proposal",1.01,"Added equations eliminating need to input survey direct labor and direct ",null,null,null,null,null,null,"MA"]
[null,null,null,null,"expenses seperately."]
["1998-07-28",null,"Design Labor & Avg. M.D. Rate",1.02,"1) Added round command to labor cost and Avg. M.D. rate formulas.",null,null,null,null,null,null,"MA"]
{"$rows_left_out":47}
{"sheet":"SURVEY MANDAY FORM INSTRUCTIONS","index":13,"n_rows":50,"n_cols":22,"rows_kept":50,"cut":false,"hidden":false,"merged":[[23,21,24,28]]}
[]
["Information regarding use of Project Summary/Manday Estimate form.",null,null,null,null,null,null,null,null,null,"1. Establish and stake alignments:"]
[null,null,null,null,null,null,null,null,null,null,null,"Engineer - L * DF / 2.48 miles per manday",null,null,null,null,null,null,null,null,"12. Bridge Surveys:"]
["Definition of a project with a 1.0 Difficulty Factor",null,null,null,null,null,null,null,null,null,null,"CADD - L * DF / 3.72 miles per manday",null,null,null,null,null,null,null,null,null,"Engineer - sum of all bridge crossings*DF / 2 bridges per manday"]
[null,null,null,null,null,null,null,null,null,null,null,"crew - L * DF / 0.5 miles per manday",null,null,null,null,null,null,null,null,null,"crew - 1 crewday per small crossing * DF"]
["1. Land lays flat to rolling.",null,null,null,null,null,null,null,null,null,"2. Update Survey:",null,null,null,null,null,null,null,null,null,"               1.5 crewdays per medium crossing * DF"]
[null,null,null,null,null,null,null,null,null,null,null,"Engineer - 1/2 * Party Chief Mandays * DF",null,null,null,null,null,null,null,null,"               2 crewdays per large crossing * DF"]
["2. Project is semi-rural (Urban portion = 50% residential, 5% business, 45% rural)",null,null,null,null,null,null,null,null,null,null,"CADD - 1/2 * Party Chief Mandays * DF",null,null,null,null,null,null,null,null,null,"       "]
[null,null,null,null,null,null,null,null,null,null,null,"crew -Number of Updates * 3 crew days per update * DF",null,null,null,null,null,null,null,null,"   A small bridge is 20ft to 60ft long"]
["3. Rural portion is 50% wooded.",null,null,null,null,null,null,null,null,null,"3. Control Traverse:",null,null,null,null,null,null,null,null,null,"   A medium bridge is 60ft to 150ft long"]
[null,null,null,null,null,null,null,null,null,null,null,"Engineer - L * DF / 1.86 miles per manday",null,null,null,null,null,null,null,null,"   A large bridge is greater than 150ft"]
["4. 10% DTM skips",null,null,null,null,null,null,null,null,null,null,"CADD - L * DF / 6.21 miles per manday",null,null,null,null,null,null,null,null,"   "]
[null,null,null,null,null,null,null,null,null,null,null,"crew - L * DF / 1.49 miles per manday",null,null,null,null,null,null,null,null,"13. Railroad Surveys:"]
["5. No severe wetlands or other environmental concerns.",null,null,null,null,null,null,null,null,null,"4. Set Aerial Control:",null,null,null,null,null,null,null,null,null,null,"Engineer - 1/3/ manday per railroad crossing * DF"]
[null,null,null,null,null,null,null,null,null,null,null,"Engineer - 1 day if there are any H or V points",null,null,null,null,null,null,null,null,null,"CADD - 1/3 manday per railroad crossing * DF"]
{"$rows_left_out":35}