{"text_format":"1","workbook":"xlsx","n_sheets":6,"sheets":["SUR IN","DES IN","ACQ TABLE(1)","Add Sheets","OWNERS","DISTURBED AREA FOOTNOTES"],"not_rendered":{"charts":0,"images":0,"macros":1,"external_links":0,"defined_names":0,"comments":0,"pivot_tables":0},"unopened":[],"bounds":{"document_bytes":16777216,"sheet_cells":100000,"rows_first":2000,"rows_last":500,"rows_between":2000,"halvings":0,"cell_chars":16384,"cell_head_chars":4096},"cells_cut":0,"cells_raw":0,"read":"whole","date_system":"1900"}

{"sheet":"SUR IN","index":0,"n_rows":504,"n_cols":26,"rows_kept":504,"cut":false,"hidden":false,"merged":[[2,4,2,5]]}
["INPUT SURVEY DATA",null,null,null,null,null,null,null,"Rev. 05\\17\\2017","INFORMATION REQUIRED FOR ALL TRACTS",null,null,null,null,null,null,"WARNINGS:"]
[null,null,"COUNTY RECORDS",null,null,null,"INPUT AREA IN SQUARE FEET"]
["TRACT","PROPERTY OWNERS","TAX","PARCEL","DEED DOCUMENT REFERENCE",null,"LEFT","RIGHT","TOTAL  FEET SQUARE","STREET ADDRESS","CITY","STATE"," ZIP","CONTACTED BY","DATE OF CONTACT","METHOD","1) * Input data in the unit specified. "]
["NO.",null,"MAP NO.","NO.","BOOK NO.","PAGE","(To enter acres, put ac after number,   ex: 1.158 ac)",null,"ADDS AUTOMATICALLY",null,null,null,null,null,null,"OF CONTACT","THE FINAL R.O.W ACQUISITION TABLE WILL MAKE ALL CONVERSIONS AS REQUIRED"]
[null,null,null,null,null,null,null,null,{"$f":"SurLtRtTot(G5,H5)","v":"0"}]
[null,null,null,null,null,null,null,null,"0"]
[null,null,null,null,null,null,null,null,"0",null,null,null,null,null,null,null,"2)  Do not delete or change the name of the 'SUR IN' or 'DES IN' worksheets."]
[null,null,null,null,null,null,null,null,"0",null,null,null,null,null,null,null,"The links and programs will no longer work correctly if the names are changed."]
[null,null,null,null,null,null,null,null,"0"]
[null,null,null,null,null,null,null,null,"0",null,null,null,null,null,null,null,"3)  IF THERE ARE MORE  THAN ONE "]
[null,null,null,null,null,null,null,null,"0",null,null,null,null,null,null,null,"(MAP, PARCEL, DEED, AND/OR PAGE) NUMBERS PER TRACT,"]
[null,null,null,null,null,null,null,null,"0",null,null,null,null,null,null,null,"PUT EACH NUMBER ON A SEPARATE LINE."]
[null,null,null,null,null,null,null,null,"0",null,null,null,null,null,null,null,"EXAMPLE","INPUT SURVEY DATA"]
[null,null,null,null,null,null,null,null,"0",null,null,null,null,null,null,null,null,"       ","                                         ","COUNTY RECORDS",null,null,null,"INPUT AREA IN SQUARE FEET"]
[null,null,null,null,null,null,null,null,"0",null,null,null,null,null,null,null,null,"TRACT","PROPERTY OWNERS","TAX","PARCEL","DEED","PAGE","LEFT","RIGHT","TOTAL  FEET SQUARE"]
[null,null,null,null,null,null,null,null,"0",null,null,null,null,null,null,null,null,"NO.",null,"MAP NO.","NO.","BK.","         ","(To enter acres, put ac after number,   ex: 1.158 ac)",null,"ADDS AUTOMATICALLY"]
[null,null,null,null,null,null,null,null,"0",null,null,null,null,null,null,null,null,1,"JOHN DOE","37B/P",38,163,192,43560,43560,{"$f":"SurLtRtTot(X17,Y17)","v":"87120"}]
[null,null,null,null,null,null,null,null,"0",null,null,null,null,null,null,null,null,null,null,"37B/P",37,158,552,null,null,{"$f":"SurLtRtTot(X18,Y18)","v":"0"}]
[null,null,null,null,null,null,null,null,"0",null,null,null,null,null,null,null,null,null,null,"37B/P",36,158,174,null,null,{"$f":"SurLtRtTot(X19,Y19)","v":"0"}]
[null,null,null,null,null,null,null,null,"0",null,null,null,null,null,null,null,null,2,"JANE HARRIS",null,1,null,null,null,427324,{"$f":"SurLtRtTot(X20,Y20)","v":"427324"}]
{"$rows_left_out":485}
{"sheet":"DES IN","index":1,"n_rows":504,"n_cols":16,"rows_kept":504,"cut":false,"hidden":false,"merged":[]}
["INPUT DESIGN DATA",null,null,null,null,null,null,null,"Rev. 07\\07\\2017"]
[" TRACT NO.      ",null,null,null," VALUES OBTAINED FROM SURVEY       ",null,"* EASEMENT (S.F.)",null,null,null,null,null,"INSTRUCTIONS"]
[null," * AREA TO BE ACQUIRED IN SQUARE FEET",null,null,"TOTAL AREA SQUARE FEET",null,"PERM. DRAINAGE","PERM. SLOPE","CONST.","AIR RIGHTS","PERM. HIGHWAY",null,"1.","* INPUT DATA IN SQUARE FEET. "]
[null,"LEFT","RIGHT","FLAG **","LEFT","RIGHT",null,null,null,null,null,null,null,"THE R.O.W. ACQUISITION TABLE WILL MAKE CONVERSIONS TO ACRES WHEN NEEDED"]
[{"$f":"IF('SUR IN'!A5=0,\"\",'SUR IN'!A5)","v":""},null,null,{"$f":"IF((E5-B5)<0,\"X\",IF((F5-C5)<0,\"X\",\"\"))","v":""},{"$f":"checkAcre('SUR IN'!G5)","v":0},{"$f":"checkAcre('SUR IN'!H5)","v":0}]
[{"$f":"IF('SUR IN'!A6=0,\"\",'SUR IN'!A6)","v":""},null,null,"",{"$f":"checkAcre('SUR IN'!G6)","v":0},{"$f":"checkAcre('SUR IN'!H6)","v":0},null,null,null,null,null,null,"2.","** A red flag  \" X \"  will appear if the area right or left acquired is "]
[{"$f":"IF('SUR IN'!A7=0,\"\",'SUR IN'!A7)","v":""},null,null,"",{"$f":"checkAcre('SUR IN'!G7)","v":0},{"$f":"checkAcre('SUR IN'!H7)","v":0},null,null,null,null,null,null,null,"greater than the total area right or left."]
[{"$f":"IF('SUR IN'!A8=0,\"\",'SUR IN'!A8)","v":""},null,null,"",{"$f":"checkAcre('SUR IN'!G8)","v":0},{"$f":"checkAcre('SUR IN'!H8)","v":0}]
[{"$f":"IF('SUR IN'!A9=0,\"\",'SUR IN'!A9)","v":""},null,null,"",{"$f":"checkAcre('SUR IN'!G9)","v":0},{"$f":"checkAcre('SUR IN'!H9)","v":0},null,null,null,null,null,null,"3.","If the values do not appear correct:"]
[{"$f":"IF('SUR IN'!A10=0,\"\",'SUR IN'!A10)","v":""},null,null,"",{"$f":"checkAcre('SUR IN'!G10)","v":0},{"$f":"checkAcre('SUR IN'!H10)","v":0},null,null,null,null,null,null,null,"Automatic calculation may be turned off -"]
[{"$f":"IF('SUR IN'!A11=0,\"\",'SUR IN'!A11)","v":""},null,null,"",{"$f":"checkAcre('SUR IN'!G11)","v":0},{"$f":"checkAcre('SUR IN'!H11)","v":0},null,null,null,null,null,null,null,null,null,"Go to worksheet Add Sheets and run macro Calculation Worksheets - Grid lines OFF ."]
[{"$f":"IF('SUR IN'!A12=0,\"\",'SUR IN'!A12)","v":""},null,null,"",{"$f":"checkAcre('SUR IN'!G12)","v":0},{"$f":"checkAcre('SUR IN'!H12)","v":0},null,null,null,null,null,null,null,"Links may be incorrect -"]
[{"$f":"IF('SUR IN'!A13=0,\"\",'SUR IN'!A13)","v":""},null,null,"",{"$f":"checkAcre('SUR IN'!G13)","v":0},{"$f":"checkAcre('SUR IN'!H13)","v":0},null,null,null,null,null,null,null,null,null,"Use the macro button to rebuild the links."]
[{"$f":"IF('SUR IN'!A14=0,\"\",'SUR IN'!A14)","v":""},null,null,"",{"$f":"checkAcre('SUR IN'!G14)","v":0},{"$f":"checkAcre('SUR IN'!H14)","v":0}]
[{"$f":"IF('SUR IN'!A15=0,\"\",'SUR IN'!A15)","v":""},null,null,"",{"$f":"checkAcre('SUR IN'!G15)","v":0},{"$f":"checkAcre('SUR IN'!H15)","v":0}]
[{"$f":"IF('SUR IN'!A16=0,\"\",'SUR IN'!A16)","v":""},null,null,"",{"$f":"checkAcre('SUR IN'!G16)","v":0},{"$f":"checkAcre('SUR IN'!H16)","v":0}]
[{"$f":"IF('SUR IN'!A17=0,\"\",'SUR IN'!A17)","v":""},null,null,"",{"$f":"checkAcre('SUR IN'!G17)","v":0},{"$f":"checkAcre('SUR IN'!H17)","v":0}]
[{"$f":"IF('SUR IN'!A18=0,\"\",'SUR IN'!A18)","v":""},null,null,"",{"$f":"checkAcre('SUR IN'!G18)","v":0},{"$f":"checkAcre('SUR IN'!H18)","v":0}]
[{"$f":"IF('SUR IN'!A19=0,\"\",'SUR IN'!A19)","v":""},null,null,"",{"$f":"checkAcre('SUR IN'!G19)","v":0},{"$f":"checkAcre('SUR IN'!H19)","v":0}]
[{"$f":"IF('SUR IN'!A20=0,\"\",'SUR IN'!A20)","v":""},null,null,"",{"$f":"checkAcre('SUR IN'!G20)","v":0},{"$f":"checkAcre('SUR IN'!H20)","v":0}]
{"$rows_left_out":485}
{"sheet":"ACQ TABLE(1)","index":2,"n_rows":59,"n_cols":20,"rows_kept":59,"cut":false,"hidden":false,"merged":[[58,1,58,6],[58,7,58,9],[3,15,4,19],[58,13,58,14],[6,13,7,13],[6,14,7,14],[58,10,58,12],[6,15,7,15],[6,16,7,16],[6,17,7,17],[6,11,7,11],[6,18,7,18],[6,19,7,19],[1,1,1,19],[0,0,0,19],[2,1,7,1],[2,2,7,2],[2,3,5,6],[2,7,5,9],[2,10,5,12],[2,13,5,14],[6,3,7,3],[6,4,7,4],[6,7,7,7],[6,8,7,8],[6,9,7,9],[6,10,7,10],[6,5,6,6],[6,12,7,12]]}
[]
[null,"R.O.W. ACQUISITION TABLE"]
[null,"TRACT NO.","PROPERTY OWNERS","COUNTY RECORDS",null,null,null,"TOTAL AREA (ACRES)",null,null,"AREA TO BE ACQUIRED (ACRES)",null,null,"AREA REMAINING (ACRES)",null,"EASEMENT (ACRES)"]
[null,null,null,null,null,null,null,null,null,null,null,null,null,null,null,"EASEMENT (SQUARE FEET)"]
[]
[]
[null,null,null,"TAX MAP NO.","PARCEL NO.","DEED DOCUMENT REFERENCE",null,"LEFT","RIGHT","TOTAL","LEFT","RIGHT","TOTAL","LEFT","RIGHT","PERM DRAINAGE","PERM  SLOPE","CONST","AIR RIGHTS","PERM   HIGHWAY"]
[null,null,null,null,null,"BOOK","PAGE"]
[null,{"$f":"sameinfo('SUR IN'!A5)","v":""},{"$f":"sameinfo('SUR IN'!B5)","v":""},{"$f":"sameinfo('SUR IN'!C5)","v":""},{"$f":"sameinfo('SUR IN'!D5)","v":""},{"$f":"sameinfo('SUR IN'!E5)","v":""},{"$f":"sameinfo('SUR IN'!F5)","v":""},{"$f":"ftoa('SUR IN'!G5)","v":""},{"$f":"ftoa('SUR IN'!H5)","v":""},{"$f":"DesLtRtTot('SUR IN'!G5,'SUR IN'!H5)","v":""},{"$f":"ftoa('DES IN'!B5)","v":""},{"$f":"ftoa('DES IN'!C5)","v":""},{"$f":"DesLtRtTot('DES IN'!B5,'DES IN'!C5)","v":""},{"$f":"arearem('SUR IN'!G5,'DES IN'!B5)","v":""},{"$f":"arearem('SUR IN'!H5,'DES IN'!C5)","v":""},{"$f":"ftof('DES IN'!G5)","v":""},{"$f":"ftof('DES IN'!H5)","v":""},{"$f":"ftof('DES IN'!I5)","v":""},{"$f":"ftof('DES IN'!J5)","v":""},{"$f":"ftof('DES IN'!K5)","v":""}]
[null,{"$f":"sameinfo('SUR IN'!A6)","v":""},{"$f":"sameinfo('SUR IN'!B6)","v":""},{"$f":"sameinfo('SUR IN'!C6)","v":""},{"$f":"sameinfo('SUR IN'!D6)","v":""},{"$f":"sameinfo('SUR IN'!E6)","v":""},{"$f":"sameinfo('SUR IN'!F6)","v":""},{"$f":"ftoa('SUR IN'!G6)","v":""},{"$f":"ftoa('SUR IN'!H6)","v":""},{"$f":"DesLtRtTot('SUR IN'!G6,'SUR IN'!H6)","v":""},{"$f":"ftoa('DES IN'!B6)","v":""},{"$f":"ftoa('DES IN'!C6)","v":""},{"$f":"DesLtRtTot('DES IN'!B6,'DES IN'!C6)","v":""},{"$f":"arearem('SUR IN'!G6,'DES IN'!B6)","v":""},{"$f":"arearem('SUR IN'!H6,'DES IN'!C6)","v":""},{"$f":"ftof('DES IN'!G6)","v":""},{"$f":"ftof('DES IN'!H6)","v":""},{"$f":"ftof('DES IN'!I6)","v":""},{"$f":"ftof('DES IN'!J6)","v":""},{"$f":"ftof('DES IN'!K6)","v":""}]
[null,{"$f":"sameinfo('SUR IN'!A7)","v":""},{"$f":"sameinfo('SUR IN'!B7)","v":""},{"$f":"sameinfo('SUR IN'!C7)","v":""},{"$f":"sameinfo('SUR IN'!D7)","v":""},{"$f":"sameinfo('SUR IN'!E7)","v":""},{"$f":"sameinfo('SUR IN'!F7)","v":""},{"$f":"ftoa('SUR IN'!G7)","v":""},{"$f":"ftoa('SUR IN'!H7)","v":""},{"$f":"DesLtRtTot('SUR IN'!G7,'SUR IN'!H7)","v":""},{"$f":"ftoa('DES IN'!B7)","v":""},{"$f":"ftoa('DES IN'!C7)","v":""},{"$f":"DesLtRtTot('DES IN'!B7,'DES IN'!C7)","v":""},{"$f":"arearem('SUR IN'!G7,'DES IN'!B7)","v":""},{"$f":"arearem('SUR IN'!H7,'DES IN'!C7)","v":""},{"$f":"ftof('DES IN'!G7)","v":""},{"$f":"ftof('DES IN'!H7)","v":""},{"$f":"ftof('DES IN'!I7)","v":""},{"$f":"ftof('DES IN'!J7)","v":""},{"$f":"ftof('DES IN'!K7)","v":""}]
[null,{"$f":"sameinfo('SUR IN'!A8)","v":""},{"$f":"sameinfo('SUR IN'!B8)","v":""},{"$f":"sameinfo('SUR IN'!C8)","v":""},{"$f":"sameinfo('SUR IN'!D8)","v":""},{"$f":"sameinfo('SUR IN'!E8)","v":""},{"$f":"sameinfo('SUR IN'!F8)","v":""},{"$f":"ftoa('SUR IN'!G8)","v":""},{"$f":"ftoa('SUR IN'!H8)","v":""},{"$f":"DesLtRtTot('SUR IN'!G8,'SUR IN'!H8)","v":""},{"$f":"ftoa('DES IN'!B8)","v":""},{"$f":"ftoa('DES IN'!C8)","v":""},{"$f":"DesLtRtTot('DES IN'!B8,'DES IN'!C8)","v":""},{"$f":"arearem('SUR IN'!G8,'DES IN'!B8)","v":""},{"$f":"arearem('SUR IN'!H8,'DES IN'!C8)","v":""},{"$f":"ftof('DES IN'!G8)","v":""},{"$f":"ftof('DES IN'!H8)","v":""},{"$f":"ftof('DES IN'!I8)","v":""},{"$f":"ftof('DES IN'!J8)","v":""},{"$f":"ftof('DES IN'!K8)","v":""}]
[null,{"$f":"sameinfo('SUR IN'!A9)","v":""},{"$f":"sameinfo('SUR IN'!B9)","v":""},{"$f":"sameinfo('SUR IN'!C9)","v":""},{"$f":"sameinfo('SUR IN'!D9)","v":""},{"$f":"sameinfo('SUR IN'!E9)","v":""},{"$f":"sameinfo('SUR IN'!F9)","v":""},{"$f":"ftoa('SUR IN'!G9)","v":""},{"$f":"ftoa('SUR IN'!H9)","v":""},{"$f":"DesLtRtTot('SUR IN'!G9,'SUR IN'!H9)","v":""},{"$f":"ftoa('DES IN'!B9)","v":""},{"$f":"ftoa('DES IN'!C9)","v":""},{"$f":"DesLtRtTot('DES IN'!B9,'DES IN'!C9)","v":""},{"$f":"arearem('SUR IN'!G9,'DES IN'!B9)","v":""},{"$f":"arearem('SUR IN'!H9,'DES IN'!C9)","v":""},{"$f":"ftof('DES IN'!G9)","v":""},{"$f":"ftof('DES IN'!H9)","v":""},{"$f":"ftof('DES IN'!I9)","v":""},{"$f":"ftof('DES IN'!J9)","v":""},{"$f":"ftof('DES IN'!K9)","v":""}]
[null,{"$f":"sameinfo('SUR IN'!A10)","v":""},{"$f":"sameinfo('SUR IN'!B10)","v":""},{"$f":"sameinfo('SUR IN'!C10)","v":""},{"$f":"sameinfo('SUR IN'!D10)","v":""},{"$f":"sameinfo('SUR IN'!E10)","v":""},{"$f":"sameinfo('SUR IN'!F10)","v":""},{"$f":"ftoa('SUR IN'!G10)","v":""},{"$f":"ftoa('SUR IN'!H10)","v":""},{"$f":"DesLtRtTot('SUR IN'!G10,'SUR IN'!H10)","v":""},{"$f":"ftoa('DES IN'!B10)","v":""},{"$f":"ftoa('DES IN'!C10)","v":""},{"$f":"DesLtRtTot('DES IN'!B10,'DES IN'!C10)","v":""},{"$f":"arearem('SUR IN'!G10,'DES IN'!B10)","v":""},{"$f":"arearem('SUR IN'!H10,'DES IN'!C10)","v":""},{"$f":"ftof('DES IN'!G10)","v":""},{"$f":"ftof('DES IN'!H10)","v":""},{"$f":"ftof('DES IN'!I10)","v":""},{"$f":"ftof('DES IN'!J10)","v":""},{"$f":"ftof('DES IN'!K10)","v":""}]
[null,{"$f":"sameinfo('SUR IN'!A11)","v":""},{"$f":"sameinfo('SUR IN'!B11)","v":""},{"$f":"sameinfo('SUR IN'!C11)","v":""},{"$f":"sameinfo('SUR IN'!D11)","v":""},{"$f":"sameinfo('SUR IN'!E11)","v":""},{"$f":"sameinfo('SUR IN'!F11)","v":""},{"$f":"ftoa('SUR IN'!G11)","v":""},{"$f":"ftoa('SUR IN'!H11)","v":""},{"$f":"DesLtRtTot('SUR IN'!G11,'SUR IN'!H11)","v":""},{"$f":"ftoa('DES IN'!B11)","v":""},{"$f":"ftoa('DES IN'!C11)","v":""},{"$f":"DesLtRtTot('DES IN'!B11,'DES IN'!C11)","v":""},{"$f":"arearem('SUR IN'!G11,'DES IN'!B11)","v":""},{"$f":"arearem('SUR IN'!H11,'DES IN'!C11)","v":""},{"$f":"ftof('DES IN'!G11)","v":""},{"$f":"ftof('DES IN'!H11)","v":""},{"$f":"ftof('DES IN'!I11)","v":""},{"$f":"ftof('DES IN'!J11)","v":""},{"$f":"ftof('DES IN'!K11)","v":""}]
[null,{"$f":"sameinfo('SUR IN'!A12)","v":""},{"$f":"sameinfo('SUR IN'!B12)","v":""},{"$f":"sameinfo('SUR IN'!C12)","v":""},{"$f":"sameinfo('SUR IN'!D12)","v":""},{"$f":"sameinfo('SUR IN'!E12)","v":""},{"$f":"sameinfo('SUR IN'!F12)","v":""},{"$f":"ftoa('SUR IN'!G12)","v":""},{"$f":"ftoa('SUR IN'!H12)","v":""},{"$f":"DesLtRtTot('SUR IN'!G12,'SUR IN'!H12)","v":""},{"$f":"ftoa('DES IN'!B12)","v":""},{"$f":"ftoa('DES IN'!C12)","v":""},{"$f":"DesLtRtTot('DES IN'!B12,'DES IN'!C12)","v":""},{"$f":"arearem('SUR IN'!G12,'DES IN'!B12)","v":""},{"$f":"arearem('SUR IN'!H12,'DES IN'!C12)","v":""},{"$f":"ftof('DES IN'!G12)","v":""},{"$f":"ftof('DES IN'!H12)","v":""},{"$f":"ftof('DES IN'!I12)","v":""},{"$f":"ftof('DES IN'!J12)","v":""},{"$f":"ftof('DES IN'!K12)","v":""}]
[null,{"$f":"sameinfo('SUR IN'!A13)","v":""},{"$f":"sameinfo('SUR IN'!B13)","v":""},{"$f":"sameinfo('SUR IN'!C13)","v":""},{"$f":"sameinfo('SUR IN'!D13)","v":""},{"$f":"sameinfo('SUR IN'!E13)","v":""},{"$f":"sameinfo('SUR IN'!F13)","v":""},{"$f":"ftoa('SUR IN'!G13)","v":""},{"$f":"ftoa('SUR IN'!H13)","v":""},{"$f":"DesLtRtTot('SUR IN'!G13,'SUR IN'!H13)","v":""},{"$f":"ftoa('DES IN'!B13)","v":""},{"$f":"ftoa('DES IN'!C13)","v":""},{"$f":"DesLtRtTot('DES IN'!B13,'DES IN'!C13)","v":""},{"$f":"arearem('SUR IN'!G13,'DES IN'!B13)","v":""},{"$f":"arearem('SUR IN'!H13,'DES IN'!C13)","v":""},{"$f":"ftof('DES IN'!G13)","v":""},{"$f":"ftof('DES IN'!H13)","v":""},{"$f":"ftof('DES IN'!I13)","v":""},{"$f":"ftof('DES IN'!J13)","v":""},{"$f":"ftof('DES IN'!K13)","v":""}]
[null,{"$f":"sameinfo('SUR IN'!A14)","v":""},{"$f":"sameinfo('SUR IN'!B14)","v":""},{"$f":"sameinfo('SUR IN'!C14)","v":""},{"$f":"sameinfo('SUR IN'!D14)","v":""},{"$f":"sameinfo('SUR IN'!E14)","v":""},{"$f":"sameinfo('SUR IN'!F14)","v":""},{"$f":"ftoa('SUR IN'!G14)","v":""},{"$f":"ftoa('SUR IN'!H14)","v":""},{"$f":"DesLtRtTot('SUR IN'!G14,'SUR IN'!H14)","v":""},{"$f":"ftoa('DES IN'!B14)","v":""},{"$f":"ftoa('DES IN'!C14)","v":""},{"$f":"DesLtRtTot('DES IN'!B14,'DES IN'!C14)","v":""},{"$f":"arearem('SUR IN'!G14,'DES IN'!B14)","v":""},{"$f":"arearem('SUR IN'!H14,'DES IN'!C14)","v":""},{"$f":"ftof('DES IN'!G14)","v":""},{"$f":"ftof('DES IN'!H14)","v":""},{"$f":"ftof('DES IN'!I14)","v":""},{"$f":"ftof('DES IN'!J14)","v":""},{"$f":"ftof('DES IN'!K14)","v":""}]
[null,{"$f":"sameinfo('SUR IN'!A15)","v":""},{"$f":"sameinfo('SUR IN'!B15)","v":""},{"$f":"sameinfo('SUR IN'!C15)","v":""},{"$f":"sameinfo('SUR IN'!D15)","v":""},{"$f":"sameinfo('SUR IN'!E15)","v":""},{"$f":"sameinfo('SUR IN'!F15)","v":""},{"$f":"ftoa('SUR IN'!G15)","v":""},{"$f":"ftoa('SUR IN'!H15)","v":""},{"$f":"DesLtRtTot('SUR IN'!G15,'SUR IN'!H15)","v":""},{"$f":"ftoa('DES IN'!B15)","v":""},{"$f":"ftoa('DES IN'!C15)","v":""},null,{"$f":"arearem('SUR IN'!G15,'DES IN'!B15)","v":""},{"$f":"arearem('SUR IN'!H15,'DES IN'!C15)","v":""},{"$f":"ftof('DES IN'!G15)","v":""},{"$f":"ftof('DES IN'!H15)","v":""},{"$f":"ftof('DES IN'!I15)","v":""},{"$f":"ftof('DES IN'!J15)","v":""},{"$f":"ftof('DES IN'!K15)","v":""}]
[null,{"$f":"sameinfo('SUR IN'!A16)","v":""},{"$f":"sameinfo('SUR IN'!B16)","v":""},{"$f":"sameinfo('SUR IN'!C16)","v":""},{"$f":"sameinfo('SUR IN'!D16)","v":""},{"$f":"sameinfo('SUR IN'!E16)","v":""},{"$f":"sameinfo('SUR IN'!F16)","v":""},{"$f":"ftoa('SUR IN'!G16)","v":""},{"$f":"ftoa('SUR IN'!H16)","v":""},{"$f":"DesLtRtTot('SUR IN'!G16,'SUR IN'!H16)","v":""},{"$f":"ftoa('DES IN'!B16)","v":""},{"$f":"ftoa('DES IN'!C16)","v":""},null,{"$f":"arearem('SUR IN'!G16,'DES IN'!B16)","v":""},{"$f":"arearem('SUR IN'!H16,'DES IN'!C16)","v":""},{"$f":"ftof('DES IN'!G16)","v":""},{"$f":"ftof('DES IN'!H16)","v":""},{"$f":"ftof('DES IN'!I16)","v":""},{"$f":"ftof('DES IN'!J16)","v":""},{"$f":"ftof('DES IN'!K16)","v":""}]
{"$rows_left_out":40}
{"sheet":"Add Sheets","index":3,"n_rows":0,"n_cols":0,"rows_kept":0,"cut":false,"hidden":false,"merged":[[0,0,0,18],[2,1,7,1],[2,2,7,2],[2,3,5,6],[2,7,5,9],[2,10,5,12],[2,13,5,14],[2,15,5,17],[6,3,7,3],[6,4,7,4],[6,15,7,15],[6,16,7,16],[6,17,7,17],[6,5,6,6],[6,7,7,7],[6,8,7,8],[58,1,58,6],[58,7,58,9],[58,13,58,14],[6,12,7,12],[6,13,7,13],[6,14,7,14],[6,9,7,9],[6,10,7,10],[6,11,7,11]]}

{"sheet":"OWNERS","index":4,"n_rows":504,"n_cols":6,"rows_kept":504,"cut":false,"hidden":false,"merged":[]}
[null,"Create Geopak owner input file and save to the project working folder",null,null,null,"Recreate the links to the \"SUR IN\" worksheet"]
["Filename:",{"$f":"\"Owners\"&A3&\".i\"&A4","v":"Owners001.iSU"}]
["001","Geopak job number"]
["SU","Operator initials"]
[{"$f":"IF('SUR IN'!A5=0,\" \",\"OWNER PAR\")","v":" "},{"$f":"IF('SUR IN'!A5=0,\"\",'SUR IN'!A5)","v":""},{"$f":"IF('SUR IN'!B5=0,\"\",'SUR IN'!B5)","v":""}]
[{"$f":"IF('SUR IN'!A6=0,\" \",\"OWNER PAR\")","v":" "},{"$f":"IF('SUR IN'!A6=0,\"\",'SUR IN'!A6)","v":""},{"$f":"IF('SUR IN'!B6=0,\"\",'SUR IN'!B6)","v":""}]
[{"$f":"IF('SUR IN'!A7=0,\" \",\"OWNER PAR\")","v":" "},{"$f":"IF('SUR IN'!A7=0,\"\",'SUR IN'!A7)","v":""},{"$f":"IF('SUR IN'!B7=0,\"\",'SUR IN'!B7)","v":""}]
[{"$f":"IF('SUR IN'!A8=0,\" \",\"OWNER PAR\")","v":" "},{"$f":"IF('SUR IN'!A8=0,\"\",'SUR IN'!A8)","v":""},{"$f":"IF('SUR IN'!B8=0,\"\",'SUR IN'!B8)","v":""}]
[{"$f":"IF('SUR IN'!A9=0,\" \",\"OWNER PAR\")","v":" "},{"$f":"IF('SUR IN'!A9=0,\"\",'SUR IN'!A9)","v":""},{"$f":"IF('SUR IN'!B9=0,\"\",'SUR IN'!B9)","v":""}]
[{"$f":"IF('SUR IN'!A10=0,\" \",\"OWNER PAR\")","v":" "},{"$f":"IF('SUR IN'!A10=0,\"\",'SUR IN'!A10)","v":""},{"$f":"IF('SUR IN'!B10=0,\"\",'SUR IN'!B10)","v":""}]
[{"$f":"IF('SUR IN'!A11=0,\" \",\"OWNER PAR\")","v":" "},{"$f":"IF('SUR IN'!A11=0,\"\",'SUR IN'!A11)","v":""},{"$f":"IF('SUR IN'!B11=0,\"\",'SUR IN'!B11)","v":""}]
[{"$f":"IF('SUR IN'!A12=0,\" \",\"OWNER PAR\")","v":" "},{"$f":"IF('SUR IN'!A12=0,\"\",'SUR IN'!A12)","v":""},{"$f":"IF('SUR IN'!B12=0,\"\",'SUR IN'!B12)","v":""}]
[{"$f":"IF('SUR IN'!A13=0,\" \",\"OWNER PAR\")","v":" "},{"$f":"IF('SUR IN'!A13=0,\"\",'SUR IN'!A13)","v":""},{"$f":"IF('SUR IN'!B13=0,\"\",'SUR IN'!B13)","v":""}]
[{"$f":"IF('SUR IN'!A14=0,\" \",\"OWNER PAR\")","v":" "},{"$f":"IF('SUR IN'!A14=0,\"\",'SUR IN'!A14)","v":""},{"$f":"IF('SUR IN'!B14=0,\"\",'SUR IN'!B14)","v":""}]
[{"$f":"IF('SUR IN'!A15=0,\" \",\"OWNER PAR\")","v":" "},{"$f":"IF('SUR IN'!A15=0,\"\",'SUR IN'!A15)","v":""},{"$f":"IF('SUR IN'!B15=0,\"\",'SUR IN'!B15)","v":""}]
[{"$f":"IF('SUR IN'!A16=0,\" \",\"OWNER PAR\")","v":" "},{"$f":"IF('SUR IN'!A16=0,\"\",'SUR IN'!A16)","v":""},{"$f":"IF('SUR IN'!B16=0,\"\",'SUR IN'!B16)","v":""}]
[{"$f":"IF('SUR IN'!A17=0,\" \",\"OWNER PAR\")","v":" "},{"$f":"IF('SUR IN'!A17=0,\"\",'SUR IN'!A17)","v":""},{"$f":"IF('SUR IN'!B17=0,\"\",'SUR IN'!B17)","v":""}]
[{"$f":"IF('SUR IN'!A18=0,\" \",\"OWNER PAR\")","v":" "},{"$f":"IF('SUR IN'!A18=0,\"\",'SUR IN'!A18)","v":""},{"$f":"IF('SUR IN'!B18=0,\"\",'SUR IN'!B18)","v":""}]
[{"$f":"IF('SUR IN'!A19=0,\" \",\"OWNER PAR\")","v":" "},{"$f":"IF('SUR IN'!A19=0,\"\",'SUR IN'!A19)","v":""},{"$f":"IF('SUR IN'!B19=0,\"\",'SUR IN'!B19)","v":""}]
[{"$f":"IF('SUR IN'!A20=0,\" \",\"OWNER PAR\")","v":" "},{"$f":"IF('SUR IN'!A20=0,\"\",'SUR IN'!A20)","v":""},{"$f":"IF('SUR IN'!B20=0,\"\",'SUR IN'!B20)","v":""}]
{"$rows_left_out":485}
{"sheet":"DISTURBED AREA FOOTNOTES","index":5,"n_rows":11,"n_cols":22,"rows_kept":11,"cut":false,"hidden":false,"merged":[[0,0,0,23],[1,10,2,22],[3,10,3,18],[4,10,4,18],[3,21,3,22],[4,21,4,22],[3,19,3,20],[4,19,4,20],[1,2,1,9],[2,2,2,9],[3,2,3,9],[4,2,4,9],[6,21,6,22],[6,2,6,9],[7,2,7,9],[10,2,1048575,9],[5,10,5,18],[5,21,5,22],[5,19,5,20],[6,10,6,18],[6,19,6,20],[5,2,5,9],[8,2,8,9],[9,2,9,9]]}
[]
[null,"①","Note",null,null,null,null,null,null,null,"DISTURBED AREA"]
[null,"②"]
[null,"③",null,null,null,null,null,null,null,null,"IN BETWEEN SLOPE LINES",null,null,null,null,null,null,null,null,null,null,"(AC)"]
[null,"④",null,null,null,null,null,null,null,null,"15 FOOT WIDE STRIP (OUT SIDE SLOPE LINES)",null,null,null,null,null,null,null,null,null,null,"(AC)"]
[null,"⑤",null,null,null,null,null,null,null,null,"TOTAL DISTURBED AREA",null,null,null,null,null,null,null,null,null,null,"(AC)"]
[null,"⑥",null,null,null,null,null,null,null,null,"TOTAL PROJECT AREA",null,null,null,null,null,null,null,null,null,null,"(AC)"]
[null,"⑦"]
[null,"⑧"]
[null,"⑨"]
[null,"⑩"]